{"text_format":"3","workbook":"xlsx","n_sheets":2,"sheets":["Sheet1","修改"],"not_rendered":{"external_links":2,"defined_names":1},"read":"whole","date_system":"1900"}

{"sheet":"Sheet1","index":0,"n_rows":121,"n_cols":7,"rows_kept":121,"merged":[[0,0,0,6]]}
["漳州市龙文区2024年公开招聘中小学国企教师\n入闱资格复审人员名单"]
["序号","姓名","岗位名称","岗位代码","成绩","排名","备注"]
[1,"唐晴雯","高中语文教师","01",107.8,1]
[2,"郑素莲","高中语文教师","01",95.6,2]
[3,"王晓娟","高中数学教师","02",100.1,1]
[4,"刘佳音","高中数学教师","02",97.1,2]
[5,"罗晓蓉","高中英语教师","03",112.8,1]
[6,"苏雅真","高中英语教师","03",112.4,2]
[7,"张丽娜","高中英语教师","03",109.9,3]
[8,"洪舒婷","高中英语教师","03",109.2,4]
[9,"吴羽梅","高中英语教师","03",107.5,5]
[10,"张薰元","高中英语教师","03",106.6,6]
[11,"郭梅艳","高中化学教师","05",101.3,1]
[12,"林雅珊","高中化学教师","05",100.9,2]
[13,"张桂燕","高中化学教师","05",98.1,3]
[14,"郑祖珍","高中生物教师","06",113.4,1]
[15,"吴怡虹","高中生物教师","06",108.5,2]
[16,"黄小丽","高中生物教师","06",107.7,3]
[17,"杨愉然","高中地理教师","07",102.9,1]
[18,"黄婉荣","高中地理教师","07",99.3,2]
[19,"周若琳","高中地理教师","07",96.5,3]
[20,"陈丽贞","高中地理教师","07",92.6,4]
[21,"陈珏","高中地理教师","07",91.2,5]
[22,"林静","高中历史教师","08",103.2,1]
[23,"肖永芬","高中历史教师","08",96.6,2]
[24,"蔡冬梅","高中政治教师","09",91.4,1]
[25,"武晶晶","高中信息技术教师","10",115.7,1]
[26,"黄贤玲","高中信息技术教师","10",102.5,2]
[27,"赵舒颖","高中信息技术教师","10",102.3,3]
[28,"王鸿绿","高中体育教师","11",116.6,1]
[29,"郑辰晗","高中体育教师","11",{"v":116,"d":"116.0"},2]
[30,"颜奇琛","高中体育教师","11",114.7,3]
[31,"马李健","高中体育教师","11",113.5,4]
[32,"何佳兴","高中体育教师","11",{"v":113,"d":"113.0"},5]
[33,"吴毅鹏","高中体育教师","11",112.4,6]
[34,"王力凡","高中体育教师","11",{"v":112,"d":"112.0"},7]
[35,"方增煌","高中体育教师","11",{"v":109,"d":"109.0"},8]
[36,"郑豪伟","高中体育教师","11",108.1,9]
[37,"柯林婷","初中语文教师","12",112.5,1]
[38,"吴嘉惠","初中语文教师","12",{"v":110,"d":"110.0"},2]
[39,"黄宇斓","初中语文教师","12",109.9,3]
[40,"黄慧洁","初中语文教师","12",109.7,4]
[41,"刘光平","初中语文教师","12",109.3,5]
[42,"胡彩芳","初中语文教师","12",108.5,6]
[43,"林珏明","初中语文教师","12",107.7,7]
[44,"王盈","初中语文教师","12",107.2,8]
[45,"陈家欣","初中语文教师","12",105.8,9]
[46,"曾愉平","初中语文教师","12",105.7,10]
[47,"张睿仪","初中语文教师","12",105.1,11]
[48,"何柳芳","初中语文教师","12",103.4,12]
[49,"林晨欣","初中语文教师","12",103.1,13]
[50,"李琪","初中语文教师","12",{"v":102,"d":"102.0"},14]
[51,"卢毓纯","初中语文教师","12",101.3,15]
[52,"杨婧","初中语文教师","12",99.5,16]
[53,"林静薇","初中语文教师","12",98.9,17]
[54,"罗丹","初中语文教师","12",98.3,18]
[55,"张秀香","初中数学教师","13",{"v":97,"d":"97.0"},1]
[56,"洪丹玲","初中数学教师","13",94.1,2]
[57,"侯旭虹","初中数学教师","13",94.1,3]
[58,"林育群","初中数学教师","13",92.9,4]
[59,"陈翌雯","初中英语教师","14",113.5,1]
[60,"汪玉萍","初中英语教师","14",112.9,2]
[61,"刘婉玲","初中英语教师","14",112.2,3]
[62,"郭佳怡","初中英语教师","14",110.8,4]
[63,"洪晓玲","初中英语教师","14",110.3,5]
[64,"郑静","初中英语教师","14",110.1,6]
[65,"陈黄蓉","初中英语教师","14",109.7,7]
[66,"邱雪儿","初中英语教师","14",108.8,8]
[67,"王惠红","初中英语教师","14",108.5,9]
[68,"林木贵","初中生物教师","16",107.2,1]
[69,"罗集锦","初中生物教师","16",106.1,2]
[70,"方怡泓","初中生物教师","16",103.3,3]
[71,"翁莉莉","初中地理教师","17",100.7,1]
[72,"黎晶","初中地理教师","17",97.7,2]
[73,"林燕妮","初中地理教师","17",96.1,3]
[74,"沈泽磊","初中地理教师","17",91.7,4]
[75,"陈美芝","初中历史教师","18",120.6,1]
[76,"沈丽聪","初中历史教师","18",{"v":103,"d":"103.0"},2]
[77,"郑学智","初中历史教师","18",{"v":102,"d":"102.0"},3]
[78,"陈斯琪","初中信息技术教师","20",{"v":111,"d":"111.0"},1]
{"$rows_left_out":42}
{"sheet":"修改","index":1,"n_rows":156,"n_cols":10,"rows_kept":156,"merged":[[0,0,0,4]]}
["漳州市龙文区2023年公开招聘中小学幼儿园国企教师\n入闱资格复审人员名单"]
["序号","岗位名称","姓名","成绩","备注","身份证","手机号","毕业院校","专业","学历"]
[1,"高中物理教师(01)","张秋宗",99.8,null,{"$f":"VLOOKUP(C3,[1]汇总!$B:$I,8,0)","v":"35062219890501101X"},{"$f":"VLOOKUP(C3,[1]汇总!$B:$K,10,0)","v":"13799838532"},"漳州师范学院","物理学","本科生"]
[2,"高中化学教师(02)","杨雅燕",117.1,null,{"$f":"VLOOKUP(C4,[1]汇总!$B:$I,8,0)","v":"350629199602250522"},{"$f":"VLOOKUP(C4,[1]汇总!$B:$K,10,0)","v":"15880133006"},"福建师范大学","高分子化学与物理","硕士研究生"]
[3,"高中地理教师(03)","谭忠清",110.2,null,{"$f":"VLOOKUP(C5,[1]汇总!$B:$I,8,0)","v":"520181199308111724"},{"$f":"VLOOKUP(C5,[1]汇总!$B:$K,10,0)","v":"18159608252"},"江西师范大学","地理科学（师范）","本科生"]
[4,"高中政治教师(04)","林佩瑜",104.6,null,{"$f":"VLOOKUP(C6,[1]汇总!$B:$I,8,0)","v":"350628199504015522"},{"$f":"VLOOKUP(C6,[1]汇总!$B:$K,10,0)","v":"18350616737"},"闽南师范大学","思想政治教育","本科生"]
[5,"高中政治教师(04)","陈沁园",104.3,null,{"$f":"VLOOKUP(C7,[1]汇总!$B:$I,8,0)","v":"350628199908083521"},{"$f":"VLOOKUP(C7,[1]汇总!$B:$K,10,0)","v":"15960658419"},"宁德师范学院","思想政治教育","本科生"]
[6,"初中政治教师(05)","杨雪萍",106.9,null,{"$f":"VLOOKUP(C8,[1]汇总!$B:$I,8,0)","v":"350600199102234021"},{"$f":"VLOOKUP(C8,[1]汇总!$B:$K,10,0)","v":"13606989054"},"闽南师范大学","思想政治教育","本科生"]
[7,"初中地理教师(06)","蔡祝旺",115.9,null,{"$f":"VLOOKUP(C9,[1]汇总!$B:$I,8,0)","v":"350681199105291011"},{"$f":"VLOOKUP(C9,[1]汇总!$B:$K,10,0)","v":"13850575520"},"安顺学院","地理科学","本科生"]
[8,"初中历史教师(07)","何铵棋",119.8,null,{"$f":"VLOOKUP(C10,[1]汇总!$B:$I,8,0)","v":"350627199811040027"},{"$f":"VLOOKUP(C10,[1]汇总!$B:$K,10,0)","v":"18960177593"},"闽南师范大学","历史学","本科生"]
[9,"初中体育教师(08)","林杰桦",105.8,null,{"$f":"VLOOKUP(C11,[1]汇总!$B:$I,8,0)","v":"350600199806272018"},{"$f":"VLOOKUP(C11,[1]汇总!$B:$K,10,0)","v":"18950895269"},"龙岩学院","体育教育","本科生"]
[10,"初中体育教师(08)","吴泳明",103.5,null,{"$f":"VLOOKUP(C12,[1]汇总!$B:$I,8,0)","v":"350629199911285016"},{"$f":"VLOOKUP(C12,[1]汇总!$B:$K,10,0)","v":"15960879033"},"闽南师范大学","体育教育","本科生"]
[11,"初中体育教师(08)","孔繁振",102.9,null,{"$f":"VLOOKUP(C13,[1]汇总!$B:$I,8,0)","v":"410426199910271014"},{"$f":"VLOOKUP(C13,[1]汇总!$B:$K,10,0)","v":"15959785057"},"三明学院","社会体育指导与管理","本科生"]
[12,"初中心理健康教育教师(09)","孙双朋",114.5,null,{"$f":"VLOOKUP(C14,[1]汇总!$B:$I,8,0)","v":"410185199409290047"},{"$f":"VLOOKUP(C14,[1]汇总!$B:$K,10,0)","v":"18959693434"},"闽南师范大学","心理学","本科生"]
[13,"小学语文教师(10)","黄跃伟",100.6,null,{"$f":"VLOOKUP(C15,[1]汇总!$B:$I,8,0)","v":"350681200003300517"},{"$f":"VLOOKUP(C15,[1]汇总!$B:$K,10,0)","v":"15959665877"},"仰恩大学","汉语言文学","本科生"]
[14,"小学语文教师(10)","林子源",99.7,null,{"$f":"VLOOKUP(C16,[1]汇总!$B:$I,8,0)","v":"350503200107301018"},{"$f":"VLOOKUP(C16,[1]汇总!$B:$K,10,0)","v":"13489728099"},"云南大学滇池学院","汉语言文学","本科生"]
[15,"小学语文教师(10)","洪景霖",99,null,{"$f":"VLOOKUP(C17,[1]汇总!$B:$I,8,0)","v":"350627199902120014"},{"$f":"VLOOKUP(C17,[1]汇总!$B:$K,10,0)","v":"15860630358"},"泉州师范学院","小学教育","本科生"]
[16,"小学语文教师(10)","罗泽坤",98.6,null,{"$f":"VLOOKUP(C18,[1]汇总!$B:$I,8,0)","v":"350622200011230037"},{"$f":"VLOOKUP(C18,[1]汇总!$B:$K,10,0)","v":"18359215978"},"宁德师范学院","小学教育","本科生"]
[17,"小学语文教师(11)","陈晓颖",109.8,null,{"$f":"VLOOKUP(C19,[1]汇总!$B:$I,8,0)","v":"350600199903060025"},{"$f":"VLOOKUP(C19,[1]汇总!$B:$K,10,0)","v":"18959638986"},"福建师范大学","汉语国际教育","本科生"]
[18,"小学语文教师(11)","黄诗珊",109.4,null,{"$f":"VLOOKUP(C20,[1]汇总!$B:$I,8,0)","v":"350628199903085069"},{"$f":"VLOOKUP(C20,[1]汇总!$B:$K,10,0)","v":"18060113530"},"泉州师范学院","小学教育","本科生"]
[19,"小学语文教师(11)","甘紫菁",109.3,null,{"$f":"VLOOKUP(C21,[1]汇总!$B:$I,8,0)","v":"350602199910101027"},{"$f":"VLOOKUP(C21,[1]汇总!$B:$K,10,0)","v":"13375966978"},"重庆师范大学涉外商贸学院","汉语言文学（师范）","本科生"]
[20,"小学语文教师(11)","王馨仪",108.7,null,{"$f":"VLOOKUP(C22,[1]汇总!$B:$I,8,0)","v":"350603200012061520"},{"$f":"VLOOKUP(C22,[1]汇总!$B:$K,10,0)","v":"15260668376"},"福州大学至诚学院","汉语言文学","本科生"]
[21,"小学语文教师(12)","范素华",112.5,null,{"$f":"VLOOKUP(C23,[1]汇总!$B:$I,8,0)","v":"350823199705261024"},{"$f":"VLOOKUP(C23,[1]汇总!$B:$K,10,0)","v":"17720795045"},"福州大学至诚学院","汉语言文学","本科生"]
[22,"小学语文教师(12)","吴雯洁",110.6,null,{"$f":"VLOOKUP(C24,[1]汇总!$B:$I,8,0)","v":"350628200001254543"},{"$f":"VLOOKUP(C24,[1]汇总!$B:$K,10,0)","v":"17759923153"},"仰恩大学","汉语言文学","本科生"]
[23,"小学语文教师(12)","雷晓芳",110.4,null,{"$f":"VLOOKUP(C25,[1]汇总!$B:$I,8,0)","v":"350424199301291424"},{"$f":"VLOOKUP(C25,[1]汇总!$B:$K,10,0)","v":"18359180186"},"闽江师范高等专科学校","初等教育（中文与社会方向）","大专"]
[24,"小学语文教师(12)","吴淑颖",110.4,null,{"$f":"VLOOKUP(C26,[1]汇总!$B:$I,8,0)","v":"350600199805022543"},{"$f":"VLOOKUP(C26,[1]汇总!$B:$K,10,0)","v":"15159675603"},"闽南师范大学","学科教学（语文）","硕士研究生"]
[25,"小学语文教师(12)","郑雅珊",109.7,null,{"$f":"VLOOKUP(C27,[1]汇总!$B:$I,8,0)","v":"350600199610121023"},{"$f":"VLOOKUP(C27,[1]汇总!$B:$K,10,0)","v":"13799829057"},"闽南师范大学","汉语言文学","本科生"]
[26,"小学语文教师(12)","黄紫红",109.6,null,{"$f":"VLOOKUP(C28,[1]汇总!$B:$I,8,0)","v":"350625200009241545"},{"$f":"VLOOKUP(C28,[1]汇总!$B:$K,10,0)","v":"15207996512"},"萍乡学院","小学教育","本科生"]
[27,"小学语文教师(12)","欧帆",109,null,{"$f":"VLOOKUP(C29,[1]汇总!$B:$I,8,0)","v":"350600199607140522"},{"$f":"VLOOKUP(C29,[1]汇总!$B:$K,10,0)","v":"15059631365"},"闽南师范大学","汉语言文学","本科生"]
[28,"小学语文教师(12)","叶雅楠",108.8,null,{"$f":"VLOOKUP(C30,[1]汇总!$B:$I,8,0)","v":"350628200201185546"},{"$f":"VLOOKUP(C30,[1]汇总!$B:$K,10,0)","v":"15396029256"},"福建师范大学","汉语言文学","本科生"]
[29,"小学语文教师(12)","叶爱萍",108.7,null,{"$f":"VLOOKUP(C31,[1]汇总!$B:$I,8,0)","v":"350628200005084545"},{"$f":"VLOOKUP(C31,[1]汇总!$B:$K,10,0)","v":"15260652650"},"闽南师范大学","学前教育","本科生"]
[30,"小学语文教师(12)","赖艺鸿",108.5,null,{"$f":"VLOOKUP(C32,[1]汇总!$B:$I,8,0)","v":"350628199711252029"},{"$f":"VLOOKUP(C32,[1]汇总!$B:$K,10,0)","v":"18859602920"},"闽南科技学院","汉语言文学","本科生"]
[31,"小学语文教师(12)","黄霖敏",108.2,null,{"$f":"VLOOKUP(C33,[1]汇总!$B:$I,8,0)","v":"350628199912055021"},{"$f":"VLOOKUP(C33,[1]汇总!$B:$K,10,0)","v":"13459694689"},"闽南科技学院","汉语言文学","本科生"]
[32,"小学语文教师(12)","林茜",108.2,null,{"$f":"VLOOKUP(C34,[1]汇总!$B:$I,8,0)","v":"350629200003023526"},{"$f":"VLOOKUP(C34,[1]汇总!$B:$K,10,0)","v":"18065659358"},"吉林师范大学博达学院","汉语言文学","本科生"]
[33,"小学语文教师(12)","林志梅",108.2,null,{"$f":"VLOOKUP(C35,[1]汇总!$B:$I,8,0)","v":"350623199807016344"},{"$f":"VLOOKUP(C35,[1]汇总!$B:$K,10,0)","v":"18960736890"},"福建幼儿师范高等专科学校","早期教育","大专"]
[34,"小学数学教师(13)","蔡锋彬",105.8,null,{"$f":"VLOOKUP(C36,[1]汇总!$B:$I,8,0)","v":"350625198905141534"},{"$f":"VLOOKUP(C36,[1]汇总!$B:$K,10,0)","v":"15006060153"},"福建师范大学","小学教育","本科生"]
[35,"小学数学教师(13)","詹江山",99.2,null,{"$f":"VLOOKUP(C37,[1]汇总!$B:$I,8,0)","v":"350783200101205036"},{"$f":"VLOOKUP(C37,[1]汇总!$B:$K,10,0)","v":"18965352532"},"宜春幼儿师范高等专科学校","数学教育","大专"]
[36,"小学数学教师(13)","曾杰辉",98.4,null,{"$f":"VLOOKUP(C38,[1]汇总!$B:$I,8,0)","v":"350583199502077710"},{"$f":"VLOOKUP(C38,[1]汇总!$B:$K,10,0)","v":"13328942760"},"宁德师范学院","化学","本科生"]
[37,"小学数学教师(13)","吴楠",97.5,null,{"$f":"VLOOKUP(C39,[1]汇总!$B:$I,8,0)","v":"350624200105122531"},{"$f":"VLOOKUP(C39,[1]汇总!$B:$K,10,0)","v":"15260129460"},"闽江师范高等专科学校","小学教育(全科教育)","大专"]
[38,"小学数学教师(14)","蓝艳丽",101.5,null,{"$f":"VLOOKUP(C40,[1]汇总!$B:$I,8,0)","v":"350681198910077646"},{"$f":"VLOOKUP(C40,[1]汇总!$B:$K,10,0)","v":"15892016321"},"福建师范大学闽南科技学院","教育技术学（教育技术学（数字媒体与制作方向））","本科生"]
[39,"小学数学教师(14)","柯敏绒",100.8,null,{"$f":"VLOOKUP(C41,[1]汇总!$B:$I,8,0)","v":"350623199604100028"},{"$f":"VLOOKUP(C41,[1]汇总!$B:$K,10,0)","v":"15606004620"},"宁德师范学院","小学教育","本科生"]
[40,"小学数学教师(14)","杨佳敏",97.7,null,{"$f":"VLOOKUP(C42,[1]汇总!$B:$I,8,0)","v":"350624199908105529"},{"$f":"VLOOKUP(C42,[1]汇总!$B:$K,10,0)","v":"13859280267"},"闽北职业技术学院","小学教育专业","大专"]
[41,"小学数学教师(14)","蓝丽霞",96.7,null,{"$f":"VLOOKUP(C43,[1]汇总!$B:$I,8,0)","v":"350629199812071522"},{"$f":"VLOOKUP(C43,[1]汇总!$B:$K,10,0)","v":"15060578612"},"漳州城市职业学院","小学教育","大专"]
[42,"小学数学教师(15)","林贞洁",108.9,null,{"$f":"VLOOKUP(C44,[1]汇总!$B:$I,8,0)","v":"350629200108280529"},{"$f":"VLOOKUP(C44,[1]汇总!$B:$K,10,0)","v":"15960879087"},"集美大学","小学教育","本科生"]
[43,"小学数学教师(15)","陈巧红",108.4,null,{"$f":"VLOOKUP(C45,[1]汇总!$B:$I,8,0)","v":"350623199812254160"},{"$f":"VLOOKUP(C45,[1]汇总!$B:$K,10,0)","v":"18759789247"},"闽南师范大学","小学教育","双学士"]
[44,"小学数学教师(15)","许信慧",107.3,null,{"$f":"VLOOKUP(C46,[1]汇总!$B:$I,8,0)","v":"350681198907242524"},{"$f":"VLOOKUP(C46,[1]汇总!$B:$K,10,0)","v":"18250696623"},"闽南师范大学","小学教育","本科生"]
[45,"小学数学教师(15)","陈淑英",107.2,null,{"$f":"VLOOKUP(C47,[1]汇总!$B:$I,8,0)","v":"350622199601250542"},{"$f":"VLOOKUP(C47,[1]汇总!$B:$K,10,0)","v":"13328942996"},"宁德师范学院","生物科学","本科生"]
[46,"小学数学教师(15)","张思婷",106.2,null,{"$f":"VLOOKUP(C48,[1]汇总!$B:$I,8,0)","v":"35062419980125302X"},{"$f":"VLOOKUP(C48,[1]汇总!$B:$K,10,0)","v":"15606053436"},"闽江师范高等专科学校","小学教育（综合理科教育）","大专"]
[47,"小学数学教师(15)","何穗锦",105.8,null,{"$f":"VLOOKUP(C49,[1]汇总!$B:$I,8,0)","v":"350623199802176621"},{"$f":"VLOOKUP(C49,[1]汇总!$B:$K,10,0)","v":"18006951008"},"龙岩学院","小学教育","本科生"]
[48,"小学数学教师(15)","王欣",105.8,null,{"$f":"VLOOKUP(C50,[1]汇总!$B:$I,8,0)","v":"350623199901287423"},{"$f":"VLOOKUP(C50,[1]汇总!$B:$K,10,0)","v":"15759118036"},"莆田学院","学前教育","本科生"]
[49,"小学数学教师(15)","陈秋萍",104.4,null,{"$f":"VLOOKUP(C51,[1]汇总!$B:$I,8,0)","v":"350623199508136629"},{"$f":"VLOOKUP(C51,[1]汇总!$B:$K,10,0)","v":"15260529996"},"莆田学院","信息与计算科学","本科生"]
[50,"小学数学教师(15)","王莹莹",104.3,null,{"$f":"VLOOKUP(C52,[1]汇总!$B:$I,8,0)","v":"350623200010173022"},{"$f":"VLOOKUP(C52,[1]汇总!$B:$K,10,0)","v":"15059611826"},"厦门工学院","信息与计算科学","本科生"]
[51,"小学数学教师(15)","胡丽敏",104.1,null,{"$f":"VLOOKUP(C53,[1]汇总!$B:$I,8,0)","v":"350622199807241043"},{"$f":"VLOOKUP(C53,[1]汇总!$B:$K,10,0)","v":"18030199993"},"集美大学诚毅学院","数学与应用数学","本科生"]
[52,"小学数学教师(15)","叶舒弘",103.1,null,{"$f":"VLOOKUP(C54,[1]汇总!$B:$I,8,0)","v":"350628199005255521"},{"$f":"VLOOKUP(C54,[1]汇总!$B:$K,10,0)","v":"18759614168"},"集美大学","教育技术学","本科生"]
[53,"小学数学教师(15)","林秋敏",102.9,null,{"$f":"VLOOKUP(C55,[1]汇总!$B:$I,8,0)","v":"350623199805215446"},{"$f":"VLOOKUP(C55,[1]汇总!$B:$K,10,0)","v":"15359717332"},"宁德师范学院","数学与应用数学","本科生"]
[54,"小学数学教师(15)","陈燕婷",102.1,null,{"$f":"VLOOKUP(C56,[1]汇总!$B:$I,8,0)","v":"350681199611041066"},{"$f":"VLOOKUP(C56,[1]汇总!$B:$K,10,0)","v":"18064572460"},"闽南师范大学","小学教育","本科生"]
[55,"小学数学教师(15)","杨淑华",102,null,{"$f":"VLOOKUP(C57,[1]汇总!$B:$I,8,0)","v":"350600199111090525"},{"$f":"VLOOKUP(C57,[1]汇总!$B:$K,10,0)","v":"13159113520"},"福建师范大学","信息与计算科学","本科生"]
[56,"小学数学教师(15)","杨舒婷",101.1,null,{"$f":"VLOOKUP(C58,[1]汇总!$B:$I,8,0)","v":"350628199501030540"},{"$f":"VLOOKUP(C58,[1]汇总!$B:$K,10,0)","v":"15060511629"},"泉州师范学院","小学教育","本科生"]
[57,"小学数学教师(15)","蔡艺晴",101,null,{"$f":"VLOOKUP(C59,[1]汇总!$B:$I,8,0)","v":"350622199308064046"},{"$f":"VLOOKUP(C59,[1]汇总!$B:$K,10,0)","v":"18859670901"},"漳州城市职业学院","初等教育（英语方向）","大专"]
[58,"小学英语教师(16)","蔡怡琳",111.2,"专业知识107",{"$f":"VLOOKUP(C60,[1]汇总!$B:$I,8,0)","v":"350628199708120041"},{"$f":"VLOOKUP(C60,[1]汇总!$B:$K,10,0)","v":"15006098299"},"吉林财经大学","英语（经贸）","本科生"]
[59,"小学音乐教师(17)","林毓",108.4,null,{"$f":"VLOOKUP(C61,[1]汇总!$B:$I,8,0)","v":"350623199806190025"},{"$f":"VLOOKUP(C61,[1]汇总!$B:$K,10,0)","v":"13003967239"},"厦门大学嘉庚学院","音乐表演","本科生"]
[60,"小学音乐教师(17)","杨伊婷",107.5,null,{"$f":"VLOOKUP(C62,[1]汇总!$B:$I,8,0)","v":"3506232000010131025"},{"$f":"VLOOKUP(C62,[1]汇总!$B:$K,10,0)","v":"15260522716"},"闽江学院","音乐学","本科生"]
[61,"小学音乐教师(17)","陈悦恩",104.7,null,{"$f":"VLOOKUP(C63,[1]汇总!$B:$I,8,0)","v":"350627200102231520"},{"$f":"VLOOKUP(C63,[1]汇总!$B:$K,10,0)","v":"18950390212"},"莆田学院","音乐学","本科生"]
[62,"小学音乐教师(17)","林楚煊",102.8,null,{"$f":"VLOOKUP(C64,[1]汇总!$B:$I,8,0)","v":"350600199912102522"},{"$f":"VLOOKUP(C64,[1]汇总!$B:$K,10,0)","v":"17850611972"},"阳光学院","音乐学","本科生"]
[63,"小学体育教师(18)","何绿梅",111.9,null,{"$f":"VLOOKUP(C65,[1]汇总!$B:$I,8,0)","v":"350623200004230529"},{"$f":"VLOOKUP(C65,[1]汇总!$B:$K,10,0)","v":"18860074407"},"集美大学","武术与民族传统体育","本科生"]
[64,"小学体育教师(18)","林伟煌",105,null,{"$f":"VLOOKUP(C66,[1]汇总!$B:$I,8,0)","v":"350627199002221514"},{"$f":"VLOOKUP(C66,[1]汇总!$B:$K,10,0)","v":"15959122372"},"福建师范大学","社会体育","本科生"]
[65,"小学体育教师(18)","郑少峰",103.1,null,{"$f":"VLOOKUP(C67,[1]汇总!$B:$I,8,0)","v":"350600199905274510"},{"$f":"VLOOKUP(C67,[1]汇总!$B:$K,10,0)","v":"17605969921"},"泉州幼儿师范高等专科学校","体育教育","本科生"]
[66,"小学体育教师(18)","李涛",102.5,null,{"$f":"VLOOKUP(C68,[1]汇总!$B:$I,8,0)","v":"500226200101014671"},{"$f":"VLOOKUP(C68,[1]汇总!$B:$K,10,0)","v":"15823123646"},"集美大学","运动训练","本科生"]
[67,"小学体育教师(18)","周志伟",101.9,null,{"$f":"VLOOKUP(C69,[1]汇总!$B:$I,8,0)","v":"430426200001258751"},{"$f":"VLOOKUP(C69,[1]汇总!$B:$K,10,0)","v":"18789351823"},"海南热带海洋学院","休闲体育（海上运动方向）","本科生"]
[68,"小学思政教师(19)","罗嫔嫔",100.4,null,{"$f":"VLOOKUP(C70,[1]汇总!$B:$I,8,0)","v":"350628200109304522"},{"$f":"VLOOKUP(C70,[1]汇总!$B:$K,10,0)","v":"18050718861"},"漳州城市职业学院","小学教育","大专"]
[69,"小学思政教师(19)","周草",98,null,{"$f":"VLOOKUP(C71,[1]汇总!$B:$I,8,0)","v":"441625199410072722"},{"$f":"VLOOKUP(C71,[1]汇总!$B:$K,10,0)","v":"13232778866"},"河源职业技术学院","学前教育","大专"]
[70,"小学科学教师(20)","李夏胤",113,null,{"$f":"VLOOKUP(C72,[1]汇总!$B:$I,8,0)","v":"350629199907132017"},{"$f":"VLOOKUP(C72,[1]汇总!$B:$K,10,0)","v":"15006029067"},"福建幼儿师范高等专科学校","科学教育","大专"]
[71,"小学科学教师(20)","陈怡玲",111.3,null,{"$f":"VLOOKUP(C73,[1]汇总!$B:$I,8,0)","v":"350600198708302522"},{"$f":"VLOOKUP(C73,[1]汇总!$B:$K,10,0)","v":"13605039533"},"龙岩学院","化学","本科生"]
[72,"小学科学教师(20)","许海毅",107,null,{"$f":"VLOOKUP(C74,[1]汇总!$B:$I,8,0)","v":"350622200009263032"},{"$f":"VLOOKUP(C74,[1]汇总!$B:$K,10,0)","v":"15859613111"},"漳州城市职业学院","科学教育","大专"]
[73,"小学心理健康教育教师(21)","张雅萍",119.5,null,{"$f":"VLOOKUP(C75,[1]汇总!$B:$I,8,0)","v":"35052520001113302X"},{"$f":"VLOOKUP(C75,[1]汇总!$B:$K,10,0)","v":"18016651108"},"泉州师范学院","学前教育","本科生"]
[74,"小学心理健康教育教师(21)","林佳菁",117.4,null,{"$f":"VLOOKUP(C76,[1]汇总!$B:$I,8,0)","v":"350628199112223023"},{"$f":"VLOOKUP(C76,[1]汇总!$B:$K,10,0)","v":"17750625363"},"赣南医学院","应用心理学","本科生"]
[75,"幼儿园教师(22)","洪伟宏",120.9,null,{"$f":"VLOOKUP(C77,[2]汇总!$B$1:$I$65536,8,0)","v":"350623199808255718"},{"$f":"VLOOKUP(C77,[2]汇总!$B$1:$K$65536,10,0)","v":"15687657063"},"昆明学院","学前教育","本科生"]
[76,"幼儿园教师(22)","连竣捷",116.1,null,{"$f":"VLOOKUP(C78,[2]汇总!$B$1:$I$65536,8,0)","v":"35062520010730153X"},{"$f":"VLOOKUP(C78,[2]汇总!$B$1:$K$65536,10,0)","v":"15059830978"},"泉州幼儿师范高等专科学校","英语教育","大专"]
[77,"幼儿园教师(22)","蒋伟钦",112.7,null,{"$f":"VLOOKUP(C79,[2]汇总!$B$1:$I$65536,8,0)","v":"350629200010140018"},{"$f":"VLOOKUP(C79,[2]汇总!$B$1:$K$65536,10,0)","v":"17750111617"},"三明学院","学前教育","本科生"]
[78,"幼儿园教师(22)","林凯",111,null,{"$f":"VLOOKUP(C80,[2]汇总!$B$1:$I$65536,8,0)","v":"350681199912190014"},{"$f":"VLOOKUP(C80,[2]汇总!$B$1:$K$65536,10,0)","v":"13235965928"},"南宁师范大学师园学院","学前教育","本科生"]
{"$rows_left_out":76}