{"text_format":"3","workbook":"xlsx","n_sheets":2,"sheets":["Sheet1","Sheet2"],"read":"whole","date_system":"1900"}

{"sheet":"Sheet1","index":0,"n_rows":15,"n_cols":10,"rows_kept":15,"merged":[[1,0,1,9],[9,1,10,1],[9,2,10,2],[9,3,10,3]]}
["附件1"]
["2023年始兴县公开选聘中小学校和幼儿园教师入围体检人员名单"]
["序号","招聘单位","岗位代码","招聘人数","准考证号","笔试成绩","面试成绩","总成绩","排名","是否进入体检"]
[1,{"$f":"VLOOKUP(C4,Sheet2!B1:C28,2,FALSE)","v":"丹凤小学"},"C23001",2,"202308050008",84,84.7,{"$f":"(F4*50%)+(G4*50%)","v":84.35},1,"是"]
[2,{"$f":"VLOOKUP(C5,Sheet2!B2:C29,2,FALSE)","v":"丹凤小学"},"C23002",1,"202308050011",72,89.4,{"$f":"(F5*50%)+(G5*50%)","v":80.7},1,"是"]
[3,{"$f":"VLOOKUP(C6,Sheet2!B3:C30,2,FALSE)","v":"高峰小学"},"C23005",1,"202308050003",77.5,83.8,80.65,1,"是"]
[4,{"$f":"VLOOKUP(C7,Sheet2!B4:C31,2,FALSE)","v":"高峰小学"},"C23006",1,"202308050007",83.5,90.8,87.15,1,"是"]
[5,{"$f":"VLOOKUP(C8,Sheet2!B5:C32,2,FALSE)","v":"墨江中学"},"C23008",1,"202308050004",82,84.9,83.45,1,"是"]
[6,{"$f":"VLOOKUP(C9,Sheet2!B6:C33,2,FALSE)","v":"九龄中学"},"C23009",2,"202308050010",81,84.1,82.55,1,"是"]
[7,{"$f":"VLOOKUP(C10,Sheet2!B7:C34,2,FALSE)","v":"九龄中学"},"C23010",2,"202308050005",77,84.2,80.6,2,"是"]
[8,{"$nulls":3},"202308050002",81,85.7,83.35,1,"是"]
[9,{"$f":"VLOOKUP(C12,Sheet2!B9:C36,2,FALSE)","v":"九龄中学"},"C23011",2,"202308050009",81,88.8,84.9,1,"是"]
[10,{"$f":"VLOOKUP(C13,Sheet2!B10:C37,2,FALSE)","v":"九龄中学"},"C23014",1,"202308050012",86,89.9,87.95,1,"是"]
[11,{"$f":"VLOOKUP(C14,Sheet2!B11:C38,2,FALSE)","v":"九龄中学"},"C23019",1,"202308050001",73,null,36.5,1]
[12,{"$f":"VLOOKUP(C15,Sheet2!B12:C39,2,FALSE)","v":"顿岗镇公立幼儿园"},"C23027",1,"202308050006",74.5,89.7,82.1,1,"是"]

{"sheet":"Sheet2","index":1,"n_rows":28,"n_cols":3,"rows_kept":28}
[null,"岗位代码","单位名称"]
[null,"C23001","丹凤小学"]
[null,"C23002","丹凤小学"]
[null,"C23003","丹凤小学"]
[null,"C23004","丹凤小学"]
[null,"C23005","高峰小学"]
[null,"C23006","高峰小学"]
[null,"C23007","太平镇中心小学"]
[null,"C23008","墨江中学"]
[null,"C23009","九龄中学"]
[null,"C23010","九龄中学"]
[null,"C23011","九龄中学"]
[null,"C23012","九龄中学"]
[null,"C23013","九龄中学"]
[null,"C23014","九龄中学"]
[null,"C23015","九龄中学"]
[null,"C23016","九龄中学"]
[null,"C23017","九龄中学"]
[null,"C23018","九龄中学"]
[null,"C23019","九龄中学"]
[null,"C23020","九龄中学"]
[null,"C23021","九龄中学"]
[null,"C23022","司前赓靖学校"]
[null,"C23023","司前赓靖学校"]
[null,"C23024","隘子中学"]
[null,"C23025","隘子中学"]
[null,"C23026","隘子中学"]
[null,"C23027","顿岗镇公立幼儿园"]