{"text_format":"3","workbook":"xlsx","n_sheets":3,"sheets":["岗位信息表","技师学院专业筛查","专业筛查（存疑）"],"not_rendered":{"defined_names":4},"read":"whole","date_system":"1900"}

{"sheet":"岗位信息表","index":0,"n_rows":276,"n_cols":15,"rows_kept":276,"merged":[[0,0,0,13],[1,0,2,0],[1,1,2,1],[1,2,2,2],[1,3,2,3],[1,4,2,4],[1,5,2,5],[1,6,2,6],[1,7,1,11],[1,12,2,12],[1,13,2,13],[274,0,274,3],[275,0,275,13]]}
["唐山市2020年市直事业单位公开招聘工作人员岗位信息表"]
["序号","主管\n部门","单位\n名称","经费\n形式","拟招聘\n人数（人）","招聘\n岗位\n名称","笔试\n专业\n类别","拟招聘岗位条件",{"$nulls":4},"备注","是否\n选聘"]
[{"$nulls":7},"学历\n底限","学位\n底限","年龄","专业或专业类别","其他"]
[1,"中国共产党唐山市委员会","所属事业单位A","全额",2,"岗位1","综合类","本科","学士","30周岁及以下","具体专业名称：软件工程、物联网工程、数字媒体艺术","限高校毕业生；中共党员或共青团员，需要政审","长期加班、值班，工作条件艰苦","否","\n\n"]
[2,"中国共产党唐山市委员会","所属事业单位B","全额",1,"岗位2","综合类","本科","学士","30周岁及以下","具体专业名称：法学、法律、宪法学与行政法学、经济法学","限高校毕业生；中共党员或共青团员，需要政审","长期加班、值班，工作条件艰苦","否","\n\n"]
[3,"中国共产党唐山市委员会","所属事业单位C","全额",1,"岗位3","综合类","本科","学士","30周岁及以下","具体专业名称：软件工程、物联网工程、计算机软件与理论","限高校毕业生；中共党员或共青团员，需要政审","长期加班、值班，工作条件艰苦","否","\n\n"]
[4,"中国共产党唐山市委员会政法委员会","唐山市综治中心","全额",1,"岗位4","综合类","本科","学士","35周岁及以下","具体专业名称：计算机科学与技术、网络工程、通信工程、软件工程、电子信息工程、信息工程","限高校毕业生",null,"否","\n\n"]
[5,"唐山市总工会","唐山市总工会职工服务中心","差额",1,"岗位5","综合类","本科","学士","30周岁及以下","具体专业名称：会计、会计学、财务管理、财务管理学","限高校毕业生",null,"否","\n\n"]
[6,"唐山市科学技术协会","唐山科技馆","全额",1,"岗位6","综合类","本科","学士","30周岁及以下","具体专业名称：人力资源管理、行政管理、会计学、财务管理、汉语言文学、秘书学","限高校毕业生",null,"否","\n\n"]
[7,"唐山市残疾人联合会","唐山市残疾人劳动就业服务中心","全额",1,"岗位7","综合类","本科","学士","35周岁及以下","具体专业名称：公共管理、网络工程、会计学、国际经济与贸易","限高校毕业生",null,"否","\n\n"]
[8,"唐山市残疾人联合会","唐山康复教育中心","全额",1,"岗位8","综合类","本科","学士","35周岁及以下","具体专业名称：针灸推拿学、中医骨伤科学、应用心理学","限高校毕业生",null,"否","\n\n"]
[9,"唐山市残疾人联合会","唐山康复教育中心","全额",1,"岗位9","综合类","硕士研究生","硕士","30周岁及以下","具体专业名称：教育经济与管理、教师发展与管理、会展管理",null,null,"否","\n\n"]
[10,"唐山市残疾人联合会","唐山康复教育中心","全额",1,"岗位10","教育类","本科","学士","35周岁及以下","具体专业名称：特殊教育、特殊教育学","限高校毕业生",null,"否","\n\n"]
[11,"唐山市发展和改革委员会","唐山市节能监察支队","全额",1,"岗位11","综合类","硕士研究生","硕士","30周岁及以下","具体专业名称：化学工程与技术、化学工程、化学工艺","限高校毕业生","工作条件艰苦","是","\n\n"]
[12,"唐山市发展和改革委员会","唐山市节能监察支队","全额",1,"岗位12","综合类","本科","学士","35周岁及以下","具体专业名称：自动化、检测技术与自动化装置、工商管理、审计学","限高校毕业生","工作条件艰苦","否","\n\n"]
[13,"唐山市发展和改革委员会","唐山市节能监察支队","全额",1,"岗位13","综合类","本科","学士","35周岁及以下","具体专业名称：自动化、检测技术与自动化装置、工商管理、审计学",null,"工作条件艰苦；具有初级及以上职称证书的年龄可放宽到40周岁及以下","否","\n\n"]
[14,"唐山市教育局","唐山市第一中学","全额",1,"岗位14","教育类","硕士研究生","硕士","35周岁及以下","具体专业名称：学科教学（化学）\n研究生一级学科：化学、化学工程与技术、材料与化工",null,null,"是","\n\n"]
[15,"唐山市教育局","唐山市第一中学","全额",2,"岗位15","教育类","硕士研究生","硕士","35周岁及以下","具体专业名称：学科教学（生物）\n研究生一级学科：生物学","限高校毕业生",null,"是","\n\n"]
[16,"唐山市教育局","唐山市第一中学","全额",1,"岗位16","教育类","硕士研究生","硕士","35周岁及以下","具体专业名称：学科教学（思政）、学科教学（思想政治教育）、思想政治教育\n研究生一级学科：政治学","限高校毕业生",null,"是","\n\n\n"]
[17,"唐山市教育局","唐山市第一中学","全额",1,"岗位17","教育类","硕士研究生","硕士","35周岁及以下","具体专业名称：体育教育学、体育教育与管理、体育教育与社会体育、体育文化与管理、学校体育教育学、学科教学（体育）\n研究生一级学科：体育学、体育","限高校毕业生",null,"是","\n\n\n"]
[18,"唐山市教育局","唐山市第一中学","全额",1,"岗位18","教育类","硕士研究生","硕士","35周岁及以下","具体专业名称：学科教学（语文）、语文教育、国际汉语教育、汉语国际教育、汉语言文化国际教育\n研究生一级学科：中国语言文学",null,null,"是","\n\n\n"]
[19,"唐山市教育局","唐山市第一中学","全额",2,"岗位19","教育类","硕士研究生","硕士","35周岁及以下","具体专业名称：学科教学（数学）\n研究生一级学科：数学","限高校毕业生",null,"是","\n\n"]
[20,"唐山市教育局","唐山市第一中学","全额",1,"岗位20","教育类","硕士研究生","硕士","35周岁及以下","具体专业名称：学科教学（物理）\n研究生一级学科：物理学、地球物理学",null,null,"是","\n\n"]
[21,"唐山市教育局","唐山市第一中学","全额",1,"岗位21","教育类","硕士研究生","硕士","35周岁及以下","研究生一级学科：计算机科学与技术、软件工程","限高校毕业生",null,"是","\n\n"]
[22,"唐山市教育局","唐山市第二中学","全额",1,"岗位22","教育类","硕士研究生","硕士","35周岁及以下","具体专业名称：学科教学（数学）\n研究生一级学科：数学","限高校毕业生",null,"是","\n\n"]
[23,"唐山市教育局","唐山市第二中学","全额",1,"岗位23","教育类","硕士研究生","硕士","35周岁及以下","具体专业名称：学科教学（物理）\n研究生一级学科：物理学、地球物理学","限高校毕业生",null,"是","\n\n"]
[24,"唐山市教育局","唐山市第二中学","全额",1,"岗位24","教育类","硕士研究生","硕士","35周岁及以下","具体专业名称：学科教学（化学）\n研究生一级学科：化学、化学工程与技术、材料与化工","限高校毕业生",null,"是","\n\n"]
[25,"唐山市教育局","唐山市第二中学","全额",2,"岗位25","教育类","硕士研究生","硕士","35周岁及以下","具体专业名称：学科教学（语文）、语文教育、国际汉语教育、汉语国际教育、汉语言文化国际教育\n研究生一级学科：中国语言文学","限高校毕业生",null,"是","\n\n\n"]
[26,"唐山市教育局","唐山市第二中学","全额",1,"岗位26","教育类","硕士研究生","硕士","35周岁及以下","具体专业名称：学科教学（英语）、英语教育、英语语言文学、英语笔译、英语口译、外国语言学及应用语言学","限高校毕业生",null,"是","\n\n"]
[27,"唐山市教育局","唐山市第二中学","全额",2,"岗位27","教育类","硕士研究生","硕士","35周岁及以下","具体专业名称：学科教学（生物）\n研究生一级学科：生物学","限高校毕业生",null,"是","\n\n"]
[28,"唐山市教育局","唐山市第二中学","全额",2,"岗位28","教育类","硕士研究生","硕士","35周岁及以下","具体专业名称：学科教学（历史）、历史学教育、历史教育学、马克思主义与中国历史进程研究\n研究生一级学科：历史学、军事思想及军事历史、中国史","限高校毕业生",null,"是","\n\n\n"]
[29,"唐山市教育局","唐山市第二中学","全额",7,"岗位29","教育类","硕士研究生","硕士","35周岁及以下","具体专业名称：学科教学（地理）、地理教育学\n研究生一级学科：地理学","限高校毕业生",null,"是","\n\n"]
[30,"唐山市教育局","唐山市第二中学","全额",2,"岗位30","教育类","硕士研究生","硕士","35周岁及以下","具体专业名称：学科教学（思政）、学科教学（思想政治教育）、思想政治教育\n研究生一级学科：政治学","限高校毕业生",null,"是","\n\n\n"]
[31,"唐山市教育局","唐山市开滦第一中学","全额",1,"岗位31","教育类","硕士研究生","硕士","30周岁及以下","具体专业名称：学科教学（语文）、语文教育、国际汉语教育、汉语国际教育、汉语言文化国际教育\n研究生一级学科：中国语言文学","限高校毕业生",null,"是","\n\n\n"]
[32,"唐山市教育局","唐山市开滦第一中学","全额",1,"岗位32","教育类","硕士研究生","硕士","30周岁及以下","具体专业名称：学科教学（语文）、语文教育、国际汉语教育、汉语国际教育、汉语言文化国际教育\n研究生一级学科：中国语言文学","具有高级中学及以上教师资格证书","高校毕业生可“先上岗、再考证”","是","\n\n\n"]
[33,"唐山市教育局","唐山市开滦第一中学","全额",1,"岗位33","教育类","硕士研究生","硕士","30周岁及以下","具体专业名称：学科教学（英语）、英语教育、国际商务英语、英语语言文学、商务英语研究、英语笔译、英语口译","限高校毕业生",null,"是","\n\n"]
[34,"唐山市教育局","唐山市开滦第一中学","全额",1,"岗位34","教育类","硕士研究生","硕士","30周岁及以下","具体专业名称：学科教学（英语）、英语教育、国际商务英语、英语语言文学、商务英语研究、英语笔译、英语口译","具有高级中学及以上教师资格证书","高校毕业生可“先上岗、再考证”","是","\n\n"]
[35,"唐山市教育局","唐山市开滦第一中学","全额",1,"岗位35","教育类","硕士研究生","硕士","30周岁及以下","具体专业名称：学科教学（数学）\n研究生一级学科：数学","限高校毕业生",null,"是","\n\n"]
[36,"唐山市教育局","唐山市开滦第一中学","全额",1,"岗位36","教育类","硕士研究生","硕士","30周岁及以下","具体专业名称：学科教学（数学）\n研究生一级学科：数学","具有高级中学及以上教师资格证书","高校毕业生可“先上岗、再考证”","是","\n\n"]
[37,"唐山市教育局","唐山市开滦第一中学","全额",1,"岗位37","教育类","硕士研究生","硕士","30周岁及以下","具体专业名称：学科教学（音乐）、音乐教育学、音乐学（音乐教育）、音乐教育与传统研究、音乐文化教育与实践、音乐、北方少数民族音乐研究、民族音乐学、体育表演与音乐学、音乐表演、音乐表演理论与实践、音乐表演与理论研究、音乐文化学、音乐文学、区域音乐与舞蹈文化、音乐评论、戏剧与影视音乐、音乐表演理论、音乐学","限高校毕业生；本硕为相关专业",null,"是","\n\n\n\n\n\n\n"]
{"$rows_left_out":237}
{"sheet":"技师学院专业筛查","index":1,"n_rows":3,"n_cols":1,"rows_kept":3,"hidden":true}
["专业名称"]
["焊接加工"]
["电气自动化设备安装与维修"]

{"sheet":"专业筛查（存疑）","index":2,"n_rows":198,"n_cols":7,"rows_kept":198,"hidden":true}
["岗位名称","学历底限","专业名称（岗位信息表）","本科库筛查","研究生库\n（一级学科）筛查","研究生库\n（二级学科）筛查","研究生库\n专硕筛查"]
["岗位2",{"$f":"IFERROR(VLOOKUP(A2,岗位信息表!$F$4:$H$87,2,0),\"\")","v":"综合类"},"律师",{"$f":"IFERROR(VLOOKUP($C2,#REF!,4,0),\"\")&IFERROR(\"；\"&VLOOKUP(C2,#REF!,3,0),\"\")","v":""},{"$f":"IFERROR(VLOOKUP(C2,#REF!,3,0),\"\")","v":""},{"$f":"IFERROR(VLOOKUP(C2,#REF!,3,0),\"\")","v":""},{"$f":"IFERROR(VLOOKUP(C2,#REF!,2,0),\"\")","v":""}]
["岗位2",{"$f":"IFERROR(VLOOKUP(A3,岗位信息表!$F$4:$H$87,2,0),\"\")","v":"综合类"},"法律事务",{"$f":"IFERROR(VLOOKUP($C3,#REF!,4,0),\"\")&IFERROR(\"；\"&VLOOKUP(C3,#REF!,3,0),\"\")","v":""},{"$f":"IFERROR(VLOOKUP(C3,#REF!,3,0),\"\")","v":""},{"$f":"IFERROR(VLOOKUP(C3,#REF!,3,0),\"\")","v":""},{"$f":"IFERROR(VLOOKUP(C3,#REF!,2,0),\"\")","v":""}]
["岗位4",{"$f":"IFERROR(VLOOKUP(A4,岗位信息表!$F$4:$H$87,2,0),\"\")","v":"综合类"},"计算机网络",{"$f":"IFERROR(VLOOKUP($C4,#REF!,4,0),\"\")&IFERROR(\"；\"&VLOOKUP(C4,#REF!,3,0),\"\")","v":""},{"$f":"IFERROR(VLOOKUP(C4,#REF!,3,0),\"\")","v":""},{"$f":"IFERROR(VLOOKUP(C4,#REF!,3,0),\"\")","v":""},{"$f":"IFERROR(VLOOKUP(C4,#REF!,2,0),\"\")","v":""}]
["岗位4",{"$f":"IFERROR(VLOOKUP(A5,岗位信息表!$F$4:$H$87,2,0),\"\")","v":"综合类"},"计算机网络技术",{"$f":"IFERROR(VLOOKUP($C5,#REF!,4,0),\"\")&IFERROR(\"；\"&VLOOKUP(C5,#REF!,3,0),\"\")","v":""},{"$f":"IFERROR(VLOOKUP(C5,#REF!,3,0),\"\")","v":""},{"$f":"IFERROR(VLOOKUP(C5,#REF!,3,0),\"\")","v":""},{"$f":"IFERROR(VLOOKUP(C5,#REF!,2,0),\"\")","v":""}]
["岗位4",{"$f":"IFERROR(VLOOKUP(A6,岗位信息表!$F$4:$H$87,2,0),\"\")","v":"综合类"},"计算机网络工程",{"$f":"IFERROR(VLOOKUP($C6,#REF!,4,0),\"\")&IFERROR(\"；\"&VLOOKUP(C6,#REF!,3,0),\"\")","v":""},{"$f":"IFERROR(VLOOKUP(C6,#REF!,3,0),\"\")","v":""},{"$f":"IFERROR(VLOOKUP(C6,#REF!,3,0),\"\")","v":""},{"$f":"IFERROR(VLOOKUP(C6,#REF!,2,0),\"\")","v":""}]
["岗位4",{"$f":"IFERROR(VLOOKUP(A7,岗位信息表!$F$4:$H$87,2,0),\"\")","v":"综合类"},"计算机网络技术工程",{"$f":"IFERROR(VLOOKUP($C7,#REF!,4,0),\"\")&IFERROR(\"；\"&VLOOKUP(C7,#REF!,3,0),\"\")","v":""},{"$f":"IFERROR(VLOOKUP(C7,#REF!,3,0),\"\")","v":""},{"$f":"IFERROR(VLOOKUP(C7,#REF!,3,0),\"\")","v":""},{"$f":"IFERROR(VLOOKUP(C7,#REF!,2,0),\"\")","v":""}]
["岗位5",{"$f":"IFERROR(VLOOKUP(A8,岗位信息表!$F$4:$H$87,2,0),\"\")","v":"综合类"},"财务会计",{"$f":"IFERROR(VLOOKUP($C8,#REF!,4,0),\"\")&IFERROR(\"；\"&VLOOKUP(C8,#REF!,3,0),\"\")","v":""},{"$f":"IFERROR(VLOOKUP(C8,#REF!,3,0),\"\")","v":""},{"$f":"IFERROR(VLOOKUP(C8,#REF!,3,0),\"\")","v":""},{"$f":"IFERROR(VLOOKUP(C8,#REF!,2,0),\"\")","v":""}]
["岗位5",{"$f":"IFERROR(VLOOKUP(A9,岗位信息表!$F$4:$H$87,2,0),\"\")","v":"综合类"},"财务信息管理",{"$f":"IFERROR(VLOOKUP($C9,#REF!,4,0),\"\")&IFERROR(\"；\"&VLOOKUP(C9,#REF!,3,0),\"\")","v":""},{"$f":"IFERROR(VLOOKUP(C9,#REF!,3,0),\"\")","v":""},{"$f":"IFERROR(VLOOKUP(C9,#REF!,3,0),\"\")","v":""},{"$f":"IFERROR(VLOOKUP(C9,#REF!,2,0),\"\")","v":""}]
["岗位8",{"$f":"IFERROR(VLOOKUP(A10,岗位信息表!$F$4:$H$87,2,0),\"\")","v":"综合类"},"针灸学",{"$f":"IFERROR(VLOOKUP($C10,#REF!,4,0),\"\")&IFERROR(\"；\"&VLOOKUP(C10,#REF!,3,0),\"\")","v":""},{"$f":"IFERROR(VLOOKUP(C10,#REF!,3,0),\"\")","v":""},{"$f":"IFERROR(VLOOKUP(C10,#REF!,3,0),\"\")","v":""},{"$f":"IFERROR(VLOOKUP(C10,#REF!,2,0),\"\")","v":""}]
["岗位9",{"$f":"IFERROR(VLOOKUP(A11,岗位信息表!$F$4:$H$87,2,0),\"\")","v":"综合类"},"公共管理类",{"$f":"IFERROR(VLOOKUP($C11,#REF!,4,0),\"\")&IFERROR(\"；\"&VLOOKUP(C11,#REF!,3,0),\"\")","v":""},{"$f":"IFERROR(VLOOKUP(C11,#REF!,3,0),\"\")","v":""},{"$f":"IFERROR(VLOOKUP(C11,#REF!,3,0),\"\")","v":""},{"$f":"IFERROR(VLOOKUP(C11,#REF!,2,0),\"\")","v":""}]
["岗位11",{"$f":"IFERROR(VLOOKUP(A12,岗位信息表!$F$4:$H$87,2,0),\"\")","v":"综合类"},"化工工程与技术类",{"$f":"IFERROR(VLOOKUP($C12,#REF!,4,0),\"\")&IFERROR(\"；\"&VLOOKUP(C12,#REF!,3,0),\"\")","v":""},{"$f":"IFERROR(VLOOKUP(C12,#REF!,3,0),\"\")","v":""},{"$f":"IFERROR(VLOOKUP(C12,#REF!,3,0),\"\")","v":""},{"$f":"IFERROR(VLOOKUP(C12,#REF!,2,0),\"\")","v":""}]
["岗位12",{"$f":"IFERROR(VLOOKUP(A13,岗位信息表!$F$4:$H$87,2,0),\"\")","v":"综合类"},"自动化或管理类",{"$f":"IFERROR(VLOOKUP($C13,#REF!,4,0),\"\")&IFERROR(\"；\"&VLOOKUP(C13,#REF!,3,0),\"\")","v":""}]
["岗位13",{"$f":"IFERROR(VLOOKUP(A14,岗位信息表!$F$4:$H$87,2,0),\"\")","v":"综合类"},"自动化或管理类",{"$f":"IFERROR(VLOOKUP($C14,#REF!,4,0),\"\")&IFERROR(\"；\"&VLOOKUP(C14,#REF!,3,0),\"\")","v":""}]
["岗位60",{"$f":"IFERROR(VLOOKUP(A15,岗位信息表!$F$4:$H$87,2,0),\"\")","v":"教育类"},"哲学",{"$f":"IFERROR(VLOOKUP($C15,#REF!,4,0),\"\")&IFERROR(\"；\"&VLOOKUP(C15,#REF!,3,0),\"\")","v":""},{"$f":"IFERROR(VLOOKUP(C15,#REF!,3,0),\"\")","v":""},{"$f":"IFERROR(VLOOKUP(C15,#REF!,3,0),\"\")","v":""},{"$f":"IFERROR(VLOOKUP(C15,#REF!,2,0),\"\")","v":""}]
["岗位60",{"$f":"IFERROR(VLOOKUP(A16,岗位信息表!$F$4:$H$87,2,0),\"\")","v":"教育类"},"政治与经济学",{"$f":"IFERROR(VLOOKUP($C16,#REF!,4,0),\"\")&IFERROR(\"；\"&VLOOKUP(C16,#REF!,3,0),\"\")","v":""},{"$f":"IFERROR(VLOOKUP(C16,#REF!,3,0),\"\")","v":""},{"$f":"IFERROR(VLOOKUP(C16,#REF!,3,0),\"\")","v":""},{"$f":"IFERROR(VLOOKUP(C16,#REF!,2,0),\"\")","v":""}]
["岗位60",{"$f":"IFERROR(VLOOKUP(A17,岗位信息表!$F$4:$H$87,2,0),\"\")","v":"教育类"},"政治学",{"$f":"IFERROR(VLOOKUP($C17,#REF!,4,0),\"\")&IFERROR(\"；\"&VLOOKUP(C17,#REF!,3,0),\"\")","v":""},{"$f":"IFERROR(VLOOKUP(C17,#REF!,3,0),\"\")","v":""},{"$f":"IFERROR(VLOOKUP(C17,#REF!,3,0),\"\")","v":""},{"$f":"IFERROR(VLOOKUP(C17,#REF!,2,0),\"\")","v":""}]
["岗位61",{"$f":"IFERROR(VLOOKUP(A18,岗位信息表!$F$4:$H$87,2,0),\"\")","v":"教育类"},"社会学（公共事业管理）",{"$f":"IFERROR(VLOOKUP($C18,#REF!,4,0),\"\")&IFERROR(\"；\"&VLOOKUP(C18,#REF!,3,0),\"\")","v":""},{"$f":"IFERROR(VLOOKUP(C18,#REF!,3,0),\"\")","v":""},{"$f":"IFERROR(VLOOKUP(C18,#REF!,3,0),\"\")","v":""},{"$f":"IFERROR(VLOOKUP(C18,#REF!,2,0),\"\")","v":""}]
["岗位61",{"$f":"IFERROR(VLOOKUP(A19,岗位信息表!$F$4:$H$87,2,0),\"\")","v":"教育类"},"教育行政学",{"$f":"IFERROR(VLOOKUP($C19,#REF!,4,0),\"\")&IFERROR(\"；\"&VLOOKUP(C19,#REF!,3,0),\"\")","v":""},{"$f":"IFERROR(VLOOKUP(C19,#REF!,3,0),\"\")","v":""},{"$f":"IFERROR(VLOOKUP(C19,#REF!,3,0),\"\")","v":""},{"$f":"IFERROR(VLOOKUP(C19,#REF!,2,0),\"\")","v":""}]
["岗位62",{"$f":"IFERROR(VLOOKUP(A20,岗位信息表!$F$4:$H$87,2,0),\"\")","v":"教育类"},"英语（翻译方向）",{"$f":"IFERROR(VLOOKUP($C20,#REF!,4,0),\"\")&IFERROR(\"；\"&VLOOKUP(C20,#REF!,3,0),\"\")","v":""},{"$f":"IFERROR(VLOOKUP(C20,#REF!,3,0),\"\")","v":""},{"$f":"IFERROR(VLOOKUP(C20,#REF!,3,0),\"\")","v":""},{"$f":"IFERROR(VLOOKUP(C20,#REF!,2,0),\"\")","v":""}]
["岗位62",{"$f":"IFERROR(VLOOKUP(A21,岗位信息表!$F$4:$H$87,2,0),\"\")","v":"教育类"},"英语（教育方向）",{"$f":"IFERROR(VLOOKUP($C21,#REF!,4,0),\"\")&IFERROR(\"；\"&VLOOKUP(C21,#REF!,3,0),\"\")","v":""},{"$f":"IFERROR(VLOOKUP(C21,#REF!,3,0),\"\")","v":""},{"$f":"IFERROR(VLOOKUP(C21,#REF!,3,0),\"\")","v":""},{"$f":"IFERROR(VLOOKUP(C21,#REF!,2,0),\"\")","v":""}]
["岗位63",{"$f":"IFERROR(VLOOKUP(A22,岗位信息表!$F$4:$H$87,2,0),\"\")","v":"教育类"},"系统科学与工程",{"$f":"IFERROR(VLOOKUP($C22,#REF!,4,0),\"\")&IFERROR(\"；\"&VLOOKUP(C22,#REF!,3,0),\"\")","v":""},{"$f":"IFERROR(VLOOKUP(C22,#REF!,3,0),\"\")","v":""},{"$f":"IFERROR(VLOOKUP(C22,#REF!,3,0),\"\")","v":""},{"$f":"IFERROR(VLOOKUP(C22,#REF!,2,0),\"\")","v":""}]
["岗位64",{"$f":"IFERROR(VLOOKUP(A23,岗位信息表!$F$4:$H$87,2,0),\"\")","v":"教育类"},"汉语言文学(新闻）",null,{"$f":"IFERROR(VLOOKUP(C23,#REF!,3,0),\"\")","v":""},{"$f":"IFERROR(VLOOKUP(C23,#REF!,3,0),\"\")","v":""},{"$f":"IFERROR(VLOOKUP(C23,#REF!,2,0),\"\")","v":""}]
["岗位64",{"$f":"IFERROR(VLOOKUP(A24,岗位信息表!$F$4:$H$87,2,0),\"\")","v":"教育类"},"汉语言文学（高级文秘）",{"$f":"IFERROR(VLOOKUP($C24,#REF!,4,0),\"\")&IFERROR(\"；\"&VLOOKUP(C24,#REF!,3,0),\"\")","v":""},{"$f":"IFERROR(VLOOKUP(C24,#REF!,3,0),\"\")","v":""},{"$f":"IFERROR(VLOOKUP(C24,#REF!,3,0),\"\")","v":""},{"$f":"IFERROR(VLOOKUP(C24,#REF!,2,0),\"\")","v":""}]
["岗位64",{"$f":"IFERROR(VLOOKUP(A25,岗位信息表!$F$4:$H$87,2,0),\"\")","v":"教育类"},"汉语言文学（编辑）",{"$f":"IFERROR(VLOOKUP($C25,#REF!,4,0),\"\")&IFERROR(\"；\"&VLOOKUP(C25,#REF!,3,0),\"\")","v":""},{"$f":"IFERROR(VLOOKUP(C25,#REF!,3,0),\"\")","v":""},{"$f":"IFERROR(VLOOKUP(C25,#REF!,3,0),\"\")","v":""},{"$f":"IFERROR(VLOOKUP(C25,#REF!,2,0),\"\")","v":""}]
["岗位65",{"$f":"IFERROR(VLOOKUP(A26,岗位信息表!$F$4:$H$87,2,0),\"\")","v":"教育类"},"学前教育",{"$f":"IFERROR(VLOOKUP($C26,#REF!,4,0),\"\")&IFERROR(\"；\"&VLOOKUP(C26,#REF!,3,0),\"\")","v":""},{"$f":"IFERROR(VLOOKUP(C26,#REF!,3,0),\"\")","v":""},{"$f":"IFERROR(VLOOKUP(C26,#REF!,3,0),\"\")","v":""},{"$f":"IFERROR(VLOOKUP(C26,#REF!,2,0),\"\")","v":""}]
["岗位66",{"$f":"IFERROR(VLOOKUP(A27,岗位信息表!$F$4:$H$87,2,0),\"\")","v":"教育类"},"学前教育",{"$f":"IFERROR(VLOOKUP($C27,#REF!,4,0),\"\")&IFERROR(\"；\"&VLOOKUP(C27,#REF!,3,0),\"\")","v":""},{"$f":"IFERROR(VLOOKUP(C27,#REF!,3,0),\"\")","v":""},{"$f":"IFERROR(VLOOKUP(C27,#REF!,3,0),\"\")","v":""},{"$f":"IFERROR(VLOOKUP(C27,#REF!,2,0),\"\")","v":""}]
["岗位67",{"$f":"IFERROR(VLOOKUP(A28,岗位信息表!$F$4:$H$87,2,0),\"\")","v":"教育类"},"儿童发展教育心理学",{"$f":"IFERROR(VLOOKUP($C28,#REF!,4,0),\"\")&IFERROR(\"；\"&VLOOKUP(C28,#REF!,3,0),\"\")","v":""},{"$f":"IFERROR(VLOOKUP(C28,#REF!,3,0),\"\")","v":""},{"$f":"IFERROR(VLOOKUP(C28,#REF!,3,0),\"\")","v":""},{"$f":"IFERROR(VLOOKUP(C28,#REF!,2,0),\"\")","v":""}]
["岗位70",{"$f":"IFERROR(VLOOKUP(A29,岗位信息表!$F$4:$H$87,2,0),\"\")","v":"教育类"},"美术教育",{"$f":"IFERROR(VLOOKUP($C29,#REF!,4,0),\"\")&IFERROR(\"；\"&VLOOKUP(C29,#REF!,3,0),\"\")","v":""},{"$f":"IFERROR(VLOOKUP(C29,#REF!,3,0),\"\")","v":""},{"$f":"IFERROR(VLOOKUP(C29,#REF!,3,0),\"\")","v":""},{"$f":"IFERROR(VLOOKUP(C29,#REF!,2,0),\"\")","v":""}]
["岗位71",{"$f":"IFERROR(VLOOKUP(A30,岗位信息表!$F$4:$H$87,2,0),\"\")","v":"综合类"},"会计",{"$f":"IFERROR(VLOOKUP($C30,#REF!,4,0),\"\")&IFERROR(\"；\"&VLOOKUP(C30,#REF!,3,0),\"\")","v":""},{"$f":"IFERROR(VLOOKUP(C30,#REF!,3,0),\"\")","v":""},{"$f":"IFERROR(VLOOKUP(C30,#REF!,3,0),\"\")","v":""},{"$f":"IFERROR(VLOOKUP(C30,#REF!,2,0),\"\")","v":""}]
["岗位74",{"$f":"IFERROR(VLOOKUP(A31,岗位信息表!$F$4:$H$87,2,0),\"\")","v":"综合类"},"会计",{"$f":"IFERROR(VLOOKUP($C31,#REF!,4,0),\"\")&IFERROR(\"；\"&VLOOKUP(C31,#REF!,3,0),\"\")","v":""},{"$f":"IFERROR(VLOOKUP(C31,#REF!,3,0),\"\")","v":""},{"$f":"IFERROR(VLOOKUP(C31,#REF!,3,0),\"\")","v":""},{"$f":"IFERROR(VLOOKUP(C31,#REF!,2,0),\"\")","v":""}]
["岗位84",{"$f":"IFERROR(VLOOKUP(A32,岗位信息表!$F$4:$H$87,2,0),\"\")","v":"综合类"},"会计",{"$f":"IFERROR(VLOOKUP($C32,#REF!,4,0),\"\")&IFERROR(\"；\"&VLOOKUP(C32,#REF!,3,0),\"\")","v":""},{"$f":"IFERROR(VLOOKUP(C32,#REF!,3,0),\"\")","v":""},{"$f":"IFERROR(VLOOKUP(C32,#REF!,3,0),\"\")","v":""},{"$f":"IFERROR(VLOOKUP(C32,#REF!,2,0),\"\")","v":""}]
["岗位94",{"$f":"IFERROR(VLOOKUP(A33,岗位信息表!$F$4:$H$87,2,0),\"\")","v":""},"医学检验",{"$f":"IFERROR(VLOOKUP($C33,#REF!,4,0),\"\")&IFERROR(\"；\"&VLOOKUP(C33,#REF!,3,0),\"\")","v":""},{"$f":"IFERROR(VLOOKUP(C33,#REF!,3,0),\"\")","v":""},{"$f":"IFERROR(VLOOKUP(C33,#REF!,3,0),\"\")","v":""},{"$f":"IFERROR(VLOOKUP(C33,#REF!,2,0),\"\")","v":""}]
["岗位120",{"$f":"IFERROR(VLOOKUP(A34,岗位信息表!$F$4:$H$87,2,0),\"\")","v":""},"高级护理",{"$f":"IFERROR(VLOOKUP($C34,#REF!,4,0),\"\")&IFERROR(\"；\"&VLOOKUP(C34,#REF!,3,0),\"\")","v":""},{"$f":"IFERROR(VLOOKUP(C34,#REF!,3,0),\"\")","v":""},{"$f":"IFERROR(VLOOKUP(C34,#REF!,3,0),\"\")","v":""},{"$f":"IFERROR(VLOOKUP(C34,#REF!,2,0),\"\")","v":""}]
["岗位121",{"$f":"IFERROR(VLOOKUP(A35,岗位信息表!$F$4:$H$87,2,0),\"\")","v":""},"高级护理",{"$f":"IFERROR(VLOOKUP($C35,#REF!,4,0),\"\")&IFERROR(\"；\"&VLOOKUP(C35,#REF!,3,0),\"\")","v":""},{"$f":"IFERROR(VLOOKUP(C35,#REF!,3,0),\"\")","v":""},{"$f":"IFERROR(VLOOKUP(C35,#REF!,3,0),\"\")","v":""},{"$f":"IFERROR(VLOOKUP(C35,#REF!,2,0),\"\")","v":""}]
["岗位129",{"$f":"IFERROR(VLOOKUP(A36,岗位信息表!$F$4:$H$87,2,0),\"\")","v":""},"机械设计制造及自动化",{"$f":"IFERROR(VLOOKUP($C36,#REF!,4,0),\"\")&IFERROR(\"；\"&VLOOKUP(C36,#REF!,3,0),\"\")","v":""},{"$f":"IFERROR(VLOOKUP(C36,#REF!,3,0),\"\")","v":""},{"$f":"IFERROR(VLOOKUP(C36,#REF!,3,0),\"\")","v":""},{"$f":"IFERROR(VLOOKUP(C36,#REF!,2,0),\"\")","v":""}]
["岗位145",{"$f":"IFERROR(VLOOKUP(A37,岗位信息表!$F$4:$H$87,2,0),\"\")","v":""},"电气工程",{"$f":"IFERROR(VLOOKUP($C37,#REF!,4,0),\"\")&IFERROR(\"；\"&VLOOKUP(C37,#REF!,3,0),\"\")","v":""},{"$f":"IFERROR(VLOOKUP(C37,#REF!,3,0),\"\")","v":""},{"$f":"IFERROR(VLOOKUP(C37,#REF!,3,0),\"\")","v":""},{"$f":"IFERROR(VLOOKUP(C37,#REF!,2,0),\"\")","v":""}]
["岗位146",{"$f":"IFERROR(VLOOKUP(A38,岗位信息表!$F$4:$H$87,2,0),\"\")","v":""},"车辆工程相关专业",{"$f":"IFERROR(VLOOKUP($C38,#REF!,4,0),\"\")&IFERROR(\"；\"&VLOOKUP(C38,#REF!,3,0),\"\")","v":""},{"$f":"IFERROR(VLOOKUP(C38,#REF!,3,0),\"\")","v":""},{"$f":"IFERROR(VLOOKUP(C38,#REF!,3,0),\"\")","v":""},{"$f":"IFERROR(VLOOKUP(C38,#REF!,2,0),\"\")","v":""}]
["岗位147",{"$f":"IFERROR(VLOOKUP(A39,岗位信息表!$F$4:$H$87,2,0),\"\")","v":""},"机械制造及自动化\n",{"$f":"IFERROR(VLOOKUP($C39,#REF!,4,0),\"\")&IFERROR(\"；\"&VLOOKUP(C39,#REF!,3,0),\"\")","v":""},{"$f":"IFERROR(VLOOKUP(C39,#REF!,3,0),\"\")","v":""},{"$f":"IFERROR(VLOOKUP(C39,#REF!,3,0),\"\")","v":""},{"$f":"IFERROR(VLOOKUP(C39,#REF!,2,0),\"\")","v":""}]
["岗位147",{"$f":"IFERROR(VLOOKUP(A40,岗位信息表!$F$4:$H$87,2,0),\"\")","v":""},"高级制造技术\n",{"$f":"IFERROR(VLOOKUP($C40,#REF!,4,0),\"\")&IFERROR(\"；\"&VLOOKUP(C40,#REF!,3,0),\"\")","v":""},{"$f":"IFERROR(VLOOKUP(C40,#REF!,3,0),\"\")","v":""},{"$f":"IFERROR(VLOOKUP(C40,#REF!,3,0),\"\")","v":""},{"$f":"IFERROR(VLOOKUP(C40,#REF!,2,0),\"\")","v":""}]
{"$rows_left_out":158}